Reaction Details
TargetNeuronal acetylcholine receptor subunit alpha-7
LigandBDBM221035
Substrate/Competitorn/a
Meas. Tech.[125I]Iodo-MLA Binding Assay
pH7.4±n/a
Ki 5500±1420 nM
Commentsextracted
Citation Carroll, FIOndachi, PW Nicotinic receptor compounds US Patent US9284322 Publication Date 3/15/2016
 
Neuronal acetylcholine receptor subunit alpha-7
Name:Neuronal acetylcholine receptor subunit alpha-7
Type:Enzyme
Mol. Mass.:56502.44
Organism:Rattus norvegicus (Rat)
Description:Q05941
Residue:502
BDBM221035
NameBDBM221035
Synonyms:US9284322, Table 6, Compound 1
TypeSmall organic molecule
Emp. Form.C16H16FN3
Mol. Mass.269.3167
SMILESFc1ncc(cc1-c1cccnc1)C1CC2CCC1N2