Reaction Details
TargetNeuronal acetylcholine receptor subunit alpha-7
LigandBDBM221046
Substrate/Competitorn/a
Meas. Tech.[125I]Iodo-MLA Binding Assay
pH7.4±n/a
Ki 1927±n/a nM
Commentsextracted
Citation Carroll, FIOndachi, PW Nicotinic receptor compounds US Patent US9284322 Publication Date 3/15/2016
 
Neuronal acetylcholine receptor subunit alpha-7
Name:Neuronal acetylcholine receptor subunit alpha-7
Type:Enzyme
Mol. Mass.:56502.44
Organism:Rattus norvegicus (Rat)
Description:Q05941
Residue:502
BDBM221046
NameBDBM221046
Synonyms:US9284322, Table 7, Compound 2
TypeSmall organic molecule
Emp. Form.C15H15FN4
Mol. Mass.270.3048
SMILESFc1ncc(cc1-c1cncnc1)C1CC2CCC1N2