Reaction Details
TargetDiacylglycerol O-acyltransferase 1
LigandBDBM220404
Substrate/Competitorn/a
Meas. Tech.PMSA Inhibition Assay
Ki 1.34±0.64 nM
IC50 30.2±14.4 nM
Citation Spiegel, DMurelli, RZhang, A Chimeric small molecules for the recruitment of antibodies to cancer cells US Patent US9296708 Publication Date 3/29/2016
 
Diacylglycerol O-acyltransferase 1
Name:Diacylglycerol O-acyltransferase 1
Type:Protein
Mol. Mass.:55297.82
Organism:Homo sapiens (Human)
Description:O75907
Residue:488
BDBM220404
NameBDBM220404
Synonyms:US9296708, 10, MeO-P4
TypeSmall organic molecule
Emp. Form.C24H41N5O12
Mol. Mass.591.6086
c1cn(CCCC[C@H](NC(=O)N[C@@H](CCC(O)=O)C(O)=O)C(O)=O)nn1