Reaction Details
TargetBromodomain-containing protein 4 [57-168]
LigandBDBM220470
Substrate/Competitorn/a
Meas. Tech.Bromodomain Domain Binding Assay
pH6±n/a
Temperature298.15±n/a K
Ki 0.84±n/a nM
Commentsextracted
Citation Wang, LPratt, JKMcDaniel, KFDai, YFidanze, SDHasvold, LHolms, JHKati, WMLiu, DMantei, RAMcClellan, WJSheppard, GSWada, CK Bromodomain inhibitors US Patent US9296741 Publication Date 3/29/2016
 
Bromodomain-containing protein 4 [57-168]
Name:Bromodomain-containing protein 4 [57-168]
Type:Enzyme Catalytic Domain
Mol. Mass.:13496.03
Organism:Homo sapiens (Human)
Description:BDI: amino acids K57-E168
Residue:112
BDBM220470
NameBDBM220470
Synonyms:US9296741, 59
TypeSmall organic molecule
Emp. Form.C21H23F2N3O4S
Mol. Mass.451.487
SMILESCn1cc(-c2cc(NS(C)(=O)=O)ccc2OC2CCC(F)(F)CC2)c2cc[nH]c2c1=O