Reaction Details
TargetBromodomain-containing protein 4 [352-457]
LigandBDBM220432
Substrate/Competitorn/a
Meas. Tech.Bromodomain Domain Binding Assay
pH6±n/a
Temperature298.15±n/a K
Ki 0.25±n/a nM
Commentsextracted
Citation Wang, LPratt, JKMcDaniel, KFDai, YFidanze, SDHasvold, LHolms, JHKati, WMLiu, DMantei, RAMcClellan, WJSheppard, GSWada, CK Bromodomain inhibitors US Patent US9296741 Publication Date 3/29/2016
 
Bromodomain-containing protein 4 [352-457]
Name:Bromodomain-containing protein 4 [352-457]
Type:Enzyme Catalytic Domain
Mol. Mass.:12432.37
Organism:Homo sapiens (Human)
Description:BDII: amino acid E352-M457
Residue:106
BDBM220432
NameBDBM220432
Synonyms:US9296741, 21
TypeSmall organic molecule
Emp. Form.C22H21N3O4S
Mol. Mass.423.485
SMILESCCS(=O)(=O)Nc1ccc(Oc2ccccc2)c(c1)-c1cn(C)c(=O)c2[nH]ccc12