Reaction Details
TargetBromodomain-containing protein 4 [352-457]
LigandBDBM220518
Substrate/Competitorn/a
Meas. Tech.Bromodomain Domain Binding Assay
pH6±n/a
Temperature298.15±n/a K
Ki 0.87±n/a nM
Commentsextracted
Citation Wang, LPratt, JKMcDaniel, KFDai, YFidanze, SDHasvold, LHolms, JHKati, WMLiu, DMantei, RAMcClellan, WJSheppard, GSWada, CK Bromodomain inhibitors US Patent US9296741 Publication Date 3/29/2016
 
Bromodomain-containing protein 4 [352-457]
Name:Bromodomain-containing protein 4 [352-457]
Type:Enzyme Catalytic Domain
Mol. Mass.:12432.37
Organism:Homo sapiens (Human)
Description:BDII: amino acid E352-M457
Residue:106
BDBM220518
NameBDBM220518
Synonyms:US9296741, 107
TypeSmall organic molecule
Emp. Form.C21H22F3N3O5S
Mol. Mass.485.477
SMILESCn1cc(-c2cc(NS(=O)(=O)CC(F)(F)F)ccc2OC2CCCOC2)c2cc[nH]c2c1=O