Reaction Details
TargetBromodomain-containing protein 4 [352-457]
LigandBDBM220749
Substrate/Competitorn/a
Meas. Tech.Bromodomain Domain Binding Assay
pH6±n/a
Temperature298.15±n/a K
Ki 12.7±n/a nM
Commentsextracted
Citation Wang, LPratt, JKMcDaniel, KFDai, YFidanze, SDHasvold, LHolms, JHKati, WMLiu, DMantei, RAMcClellan, WJSheppard, GSWada, CK Bromodomain inhibitors US Patent US9296741 Publication Date 3/29/2016
 
Bromodomain-containing protein 4 [352-457]
Name:Bromodomain-containing protein 4 [352-457]
Type:Enzyme Catalytic Domain
Mol. Mass.:12432.37
Organism:Homo sapiens (Human)
Description:BDII: amino acid E352-M457
Residue:106
BDBM220749
NameBDBM220749
Synonyms:US9296741, 338
TypeSmall organic molecule
Emp. Form.C28H29F2N5O5S
Mol. Mass.585.622
SMILESCCS(=O)(=O)Nc1ccc(Oc2ccc(F)cc2F)c(c1)-c1cn(C)c(=O)c2[nH]c(cc12)C(=O)N1CCN(C)CC1