Reaction Details
TargetArginase-2, mitochondrial
LigandBDBM290368
Substrate/Competitorn/a
Meas. Tech.Inhibition Assay of Arginase
pH7.4±n/a
Temperature298.15±n/a K
IC50<250±n/a nM
Commentsextracted
Citation Van Zandt, MJagdmann, GE Arginase inhibitors as therapeutics US Patent US10098902 Publication Date 10/16/2018
 
Arginase-2, mitochondrial
Name:Arginase-2, mitochondrial
Type:PROTEIN
Mol. Mass.:38576.93
Organism:Homo sapiens (Human)
Description:ChEMBL_978892
Residue:354
BDBM290368
NameBDBM290368
Synonyms:(2S,3S)-3-amino-2-(3-boronopropyl)tetrahydrofuran-3-carboxylic acid US10603330, Example 4 | US11389464, Example 4
TypeSmall organic molecule
Emp. Form.C8H16BNO5
Mol. Mass.217.027
SMILESN[C@]1(CCO[C@H]1CCCB(O)O)C(O)=O