Reaction Details
TargetArginase-1
LigandBDBM290397
Substrate/Competitorn/a
Meas. Tech.Inhibition Assay of Arginase
pH7.4±n/a
Temperature298.15±n/a K
IC50<250±n/a nM
Commentsextracted
Citation Van Zandt, MJagdmann, GE Arginase inhibitors as therapeutics US Patent US10098902 Publication Date 10/16/2018
 
Arginase-1
Name:Arginase-1
Type:PROTEIN
Mol. Mass.:34737.53
Organism:Homo sapiens (Human)
Description:ChEMBL_978893
Residue:322
BDBM290397
NameBDBM290397
Synonyms:(3R,4S)-3-amino-4-(3-boronopropyl)-1-(2-(piperidin-1- yl)ethyl)pyrrolidine-3-carboxylic acid US10603330, Example 33 | US11389464, Example 33
TypeSmall organic molecule
Emp. Form.C15H30BN3O4
Mol. Mass.327.227
SMILESN[C@]1(CN(CCN2CCCCC2)C[C@@H]1CCCB(O)O)C(O)=O