Reaction Details
TargetArginase-1
LigandBDBM290403
Substrate/Competitorn/a
Meas. Tech.Inhibition Assay of Arginase
pH7.4±n/a
Temperature298.15±n/a K
IC50<250±n/a nM
Commentsextracted
Citation Van Zandt, MJagdmann, GE Arginase inhibitors as therapeutics US Patent US10098902 Publication Date 10/16/2018
 
Arginase-1
Name:Arginase-1
Type:PROTEIN
Mol. Mass.:34737.53
Organism:Homo sapiens (Human)
Description:ChEMBL_978893
Residue:322
BDBM290403
NameBDBM290403
Synonyms:(3R,4S)-3-amino-4-(3-boronopropyl)-1-(((S)-1,2,3,4- tetrahydroisoquinolin-3-yl)methyl)pyrrolidine-3-carboxylic acid US10603330, Example 39 | US11389464, Example 39
TypeSmall organic molecule
Emp. Form.C18H28BN3O4
Mol. Mass.361.244
SMILESN[C@]1(CN(C[C@@H]2Cc3ccccc3CN2)C[C@@H]1CCCB(O)O)C(O)=O