Reaction Details
TargetArginase-1
LigandBDBM290407
Substrate/Competitorn/a
Meas. Tech.Inhibition Assay of Arginase
pH7.4±n/a
Temperature298.15±n/a K
IC50<250±n/a nM
Commentsextracted
Citation Van Zandt, MJagdmann, GE Arginase inhibitors as therapeutics US Patent US10098902 Publication Date 10/16/2018
 
Arginase-1
Name:Arginase-1
Type:PROTEIN
Mol. Mass.:34737.53
Organism:Homo sapiens (Human)
Description:ChEMBL_978893
Residue:322
BDBM290407
NameBDBM290407
Synonyms:(3R,4S)-3-amino-4-(3-boronopropyl)-1-((S)-pyrrolidine-2- carbonyl)pyrrolidine-3-carboxylic acid US10603330, Example 43 | US11389464, Example 43
TypeSmall organic molecule
Emp. Form.C13H24BN3O5
Mol. Mass.313.158
SMILESN[C@]1(CN(C[C@@H]1CCCB(O)O)C(=O)C1CCCN1)C(O)=O