Reaction Details
TargetArginase-1
LigandBDBM290408
Substrate/Competitorn/a
Meas. Tech.Inhibition Assay of Arginase
pH7.4±n/a
Temperature298.15±n/a K
IC50<250±n/a nM
Commentsextracted
Citation Van Zandt, MJagdmann, GE Arginase inhibitors as therapeutics US Patent US10098902 Publication Date 10/16/2018
 
Arginase-1
Name:Arginase-1
Type:PROTEIN
Mol. Mass.:34737.53
Organism:Homo sapiens (Human)
Description:ChEMBL_978893
Residue:322
BDBM290408
NameBDBM290408
Synonyms:(3R,4S)-3-amino-1-(2-aminocyclohexyl)-4-(3- boronopropyl)pyrrolidine-3-carboxylic acid US10603330, Example 44 | US11389464, Example 44
TypeSmall organic molecule
Emp. Form.C14H28BN3O4
Mol. Mass.313.201
SMILESNC1CCCCC1N1C[C@H](CCCB(O)O)[C@@](N)(C1)C(O)=O