Reaction Details
TargetArginase-2, mitochondrial
LigandBDBM290416
Substrate/Competitorn/a
Meas. Tech.Inhibition Assay of Arginase
pH7.4±n/a
Temperature298.15±n/a K
IC50<250±n/a nM
Commentsextracted
Citation Van Zandt, MJagdmann, GE Arginase inhibitors as therapeutics US Patent US10098902 Publication Date 10/16/2018
 
Arginase-2, mitochondrial
Name:Arginase-2, mitochondrial
Type:PROTEIN
Mol. Mass.:38576.93
Organism:Homo sapiens (Human)
Description:ChEMBL_978892
Residue:354
BDBM290416
NameBDBM290416
Synonyms:(3R,4S)-3-amino-1-(2-(biphenyl-4-ylamino)ethyl)-4-(3- boronopropyl)pyrrolidine-3-carboxylic acid US10603330, Example 52 | US11389464, Example 52
TypeSmall organic molecule
Emp. Form.C22H30BN3O4
Mol. Mass.411.302
SMILESN[C@]1(CN(CCNc2ccc(cc2)-c2ccccc2)C[C@@H]1CCCB(O)O)C(O)=O