Reaction Details
TargetArginase-2, mitochondrial
LigandBDBM290425
Substrate/Competitorn/a
Meas. Tech.Inhibition Assay of Arginase
pH7.4±n/a
Temperature298.15±n/a K
IC50 625±n/a nM
Commentsextracted
Citation Van Zandt, MJagdmann, GE Arginase inhibitors as therapeutics US Patent US10098902 Publication Date 10/16/2018
 
Arginase-2, mitochondrial
Name:Arginase-2, mitochondrial
Type:PROTEIN
Mol. Mass.:38576.93
Organism:Homo sapiens (Human)
Description:ChEMBL_978892
Residue:354
BDBM290425
NameBDBM290425
Synonyms:(1S,2S,4S)-1,4-diamino-2-(3-boronopropyl)cyclopentanecarboxylic acid | US10098902, Example 61
TypeSmall organic molecule
Emp. Form.C10H23BN2O4
Mol. Mass.246.112
SMILESCC(OO)[C@]1(N)C[C@@H](N)C[C@@H]1CCCB(O)O