Reaction Details
TargetAmine oxidase [flavin-containing] B
LigandBDBM220870
Substrate/CompetitorUS9302986, benzylamine
Meas. Tech.MAO-B Inhibition Assay
pH7.4±n/a
Temperature310.15±n/a K
IC50>10000±n/a nM
Commentsextracted
Citation Deodhar, MFindlay, ADFoot, JSJarolimek, WMcdonald, IARobertson, ADTurner, CI Substituted 3-haloallylamine inhibitors of ASSAO and uses thereof US Patent US9302986 Publication Date 4/5/2016
 
Amine oxidase [flavin-containing] B
Name:Amine oxidase [flavin-containing] B
Type:Protein
Mol. Mass.:58768.76
Organism:Homo sapiens (Human)
Description:P27338
Residue:520
BDBM220870
US9302986, benzylamine
NameBDBM220870
Synonyms:US9302986, 3
TypeSmall organic molecule
Emp. Form.C11H13FN2O2
Mol. Mass.224.2315
SMILESNC\C(COc1ccc(cc1)C(N)=O)=C/F