Reaction Details
TargetAmiloride-sensitive amine oxidase [copper-containing]
LigandBDBM220875
Substrate/CompetitorUS9302986, benzylamine
Meas. Tech.DAO Inhibition Assay
pH7.4±n/a
Temperature310.15±n/a K
IC50>10000±n/a nM
Commentsextracted
Citation Deodhar, MFindlay, ADFoot, JSJarolimek, WMcdonald, IARobertson, ADTurner, CI Substituted 3-haloallylamine inhibitors of ASSAO and uses thereof US Patent US9302986 Publication Date 4/5/2016
 
Amiloride-sensitive amine oxidase [copper-containing]
Name:Amiloride-sensitive amine oxidase [copper-containing]
Type:Protein
Mol. Mass.:85387.64
Organism:Homo sapiens (Human)
Description:P19801
Residue:751
BDBM220875
US9302986, benzylamine
NameBDBM220875
Synonyms:US9302986, 14
TypeSmall organic molecule
Emp. Form.C12H17FN2O3S
Mol. Mass.288.338
SMILESCN(C)S(=O)(=O)c1ccc(OC\C(CN)=C\F)cc1