Reaction Details
TargetAmiloride-sensitive amine oxidase [copper-containing]
LigandBDBM220867
Substrate/CompetitorUS9302986, benzylamine
Meas. Tech.DAO Inhibition Assay
pH7.4±n/a
Temperature310.15±n/a K
IC50>10000±n/a nM
Commentsextracted
Citation Deodhar, MFindlay, ADFoot, JSJarolimek, WMcdonald, IARobertson, ADTurner, CI Substituted 3-haloallylamine inhibitors of ASSAO and uses thereof US Patent US9302986 Publication Date 4/5/2016
 
Amiloride-sensitive amine oxidase [copper-containing]
Name:Amiloride-sensitive amine oxidase [copper-containing]
Type:Protein
Mol. Mass.:85387.64
Organism:Homo sapiens (Human)
Description:P19801
Residue:751
BDBM220867
US9302986, benzylamine
NameBDBM220867
Synonyms:US9302986, 24
TypeSmall organic molecule
Emp. Form.C15H21FN2O2
Mol. Mass.280.3378
SMILESCCN(CC)C(=O)c1ccc(OC\C(CN)=C\F)cc1