Reaction Details
TargetAmiloride-sensitive amine oxidase [copper-containing]
LigandBDBM220868
Substrate/CompetitorUS9302986, benzylamine
Meas. Tech.DAO Inhibition Assay
pH7.4±n/a
Temperature310.15±n/a K
IC50<1000±n/a nM
Commentsextracted
Citation Deodhar, MFindlay, ADFoot, JSJarolimek, WMcdonald, IARobertson, ADTurner, CI Substituted 3-haloallylamine inhibitors of ASSAO and uses thereof US Patent US9302986 Publication Date 4/5/2016
 
Amiloride-sensitive amine oxidase [copper-containing]
Name:Amiloride-sensitive amine oxidase [copper-containing]
Type:Protein
Mol. Mass.:85387.64
Organism:Homo sapiens (Human)
Description:P19801
Residue:751
BDBM220868
US9302986, benzylamine
NameBDBM220868
Synonyms:US9302986, 25
TypeSmall organic molecule
Emp. Form.C12H15FN2O2
Mol. Mass.238.2581
SMILESCNC(=O)c1ccc(OC\C(CN)=C\F)cc1