Reaction Details
TargetCannabinoid receptor 1
LigandBDBM221124
Substrate/Competitorn/a
Meas. Tech.cAMP Assay
Temperature310.15±n/a K
EC50>10000±n/a nM
Commentsextracted
Citation Bendels, SGrether, UKimbara, ANettekoven, MRoever, SRogers-Evans, MSchaffter, ESchulz-Gasch, T Pyridine-2-amides useful as CB2 agonists US Patent US9303012 Publication Date 4/5/2016
 
Cannabinoid receptor 1
Name:Cannabinoid receptor 1
Type:G Protein-Coupled Receptor (GPCR)
Mol. Mass.:52868.96
Organism:Homo sapiens (Human)
Description:P21554
Residue:472
BDBM221124
NameBDBM221124
Synonyms:US9303012, 50
TypeSmall organic molecule
Emp. Form.C23H30F2N4O3
Mol. Mass.448.5061
SMILESCC(=O)N1CCC(CC1)N(C1CC1)C(=O)c1ccc(N2CC(F)(F)C2)c(OCC2CC2)n1