Reaction Details
TargetCannabinoid receptor 1
LigandBDBM221144
Substrate/Competitorn/a
Meas. Tech.cAMP Assay
Temperature310.15±n/a K
EC50>10000±n/a nM
Commentsextracted
Citation Bendels, SGrether, UKimbara, ANettekoven, MRoever, SRogers-Evans, MSchaffter, ESchulz-Gasch, T Pyridine-2-amides useful as CB2 agonists US Patent US9303012 Publication Date 4/5/2016
 
Cannabinoid receptor 1
Name:Cannabinoid receptor 1
Type:G Protein-Coupled Receptor (GPCR)
Mol. Mass.:52868.96
Organism:Homo sapiens (Human)
Description:P21554
Residue:472
BDBM221144
NameBDBM221144
Synonyms:US9303012, 70
TypeSmall organic molecule
Emp. Form.C19H23F2N3O3
Mol. Mass.379.401
SMILESFC1(F)CN(C1)c1ccc(nc1OCC1CC1)C(=O)N1CC2CCOC2C1