Reaction Details
TargetNuclear receptor ROR-gamma [258-518,Y502F]
LigandBDBM221233
Substrate/Competitorn/a
Meas. Tech.RORγt Reporter Assay
IC50 72±n/a nM
Citation Leonard, KABarbay, KEdwards, JPKreutter, KDKummer, DAMaharoof, UNishimura, RUrbanski, MVenkatesan, HWang, AWolin, RLWoods, CRFourie, AXue, X Heteroaryl linked quinolinyl modulators of RORγt US Patent US9303015 Publication Date 4/5/2016
 
Nuclear receptor ROR-gamma [258-518,Y502F]
Name:Nuclear receptor ROR-gamma [258-518,Y502F]
Type:Enzyme
Mol. Mass.:30130.98
Organism:Homo sapiens (Human)
Description:Artificial LBD sequence mutated AF2 domain (Seq No: 9)
Residue:261
BDBM221233
NameBDBM221233
Synonyms:US9303015, 7
TypeSmall organic molecule
Emp. Form.C31H27Cl2N3O2
Mol. Mass.544.471
SMILESCCN(CC)c1nc2ccc(cc2c(Cl)c1Oc1ccccc1)C(O)(c1cccnc1)c1cccc(Cl)c1