Reaction Details
TargetNuclear receptor ROR-gamma [258-518,Y502F]
LigandBDBM221243
Substrate/Competitorn/a
Meas. Tech.RORγt Reporter Assay
IC50 150±n/a nM
Citation Leonard, KABarbay, KEdwards, JPKreutter, KDKummer, DAMaharoof, UNishimura, RUrbanski, MVenkatesan, HWang, AWolin, RLWoods, CRFourie, AXue, X Heteroaryl linked quinolinyl modulators of RORγt US Patent US9303015 Publication Date 4/5/2016
 
Nuclear receptor ROR-gamma [258-518,Y502F]
Name:Nuclear receptor ROR-gamma [258-518,Y502F]
Type:Enzyme
Mol. Mass.:30130.98
Organism:Homo sapiens (Human)
Description:Artificial LBD sequence mutated AF2 domain (Seq No: 9)
Residue:261
BDBM221243
NameBDBM221243
Synonyms:US9303015, 17
TypeSmall organic molecule
Emp. Form.C28H26ClN5O3
Mol. Mass.515.991
SMILESCOc1ccc(cn1)C(O)(c1cncn1C)c1ccc2nc(N(C)C)c(Oc3ccccc3)c(Cl)c2c1