Reaction Details
TargetNuclear receptor ROR-gamma [258-518,Y502F]
LigandBDBM221246
Substrate/Competitorn/a
Meas. Tech.RORγt Reporter Assay
IC50 110±n/a nM
Citation Leonard, KABarbay, KEdwards, JPKreutter, KDKummer, DAMaharoof, UNishimura, RUrbanski, MVenkatesan, HWang, AWolin, RLWoods, CRFourie, AXue, X Heteroaryl linked quinolinyl modulators of RORγt US Patent US9303015 Publication Date 4/5/2016
 
Nuclear receptor ROR-gamma [258-518,Y502F]
Name:Nuclear receptor ROR-gamma [258-518,Y502F]
Type:Enzyme
Mol. Mass.:30130.98
Organism:Homo sapiens (Human)
Description:Artificial LBD sequence mutated AF2 domain (Seq No: 9)
Residue:261
BDBM221246
NameBDBM221246
Synonyms:US9303015, 20
TypeSmall organic molecule
Emp. Form.C28H18ClN5O2
Mol. Mass.491.928
SMILESCn1cncc1C(O)(c1ccc(Cl)cc1)c1ccc2nc(C#N)c(Oc3ccccc3)c(C#N)c2c1