Reaction Details
TargetNuclear receptor ROR-gamma [258-518,Y502F]
LigandBDBM221265
Substrate/Competitorn/a
Meas. Tech.RORγt Reporter Assay
IC50 170±n/a nM
Citation Leonard, KABarbay, KEdwards, JPKreutter, KDKummer, DAMaharoof, UNishimura, RUrbanski, MVenkatesan, HWang, AWolin, RLWoods, CRFourie, AXue, X Heteroaryl linked quinolinyl modulators of RORγt US Patent US9303015 Publication Date 4/5/2016
 
Nuclear receptor ROR-gamma [258-518,Y502F]
Name:Nuclear receptor ROR-gamma [258-518,Y502F]
Type:Enzyme
Mol. Mass.:30130.98
Organism:Homo sapiens (Human)
Description:Artificial LBD sequence mutated AF2 domain (Seq No: 9)
Residue:261
BDBM221265
NameBDBM221265
Synonyms:US9303015, 39
TypeSmall organic molecule
Emp. Form.C29H22Cl3N3O
Mol. Mass.534.863
SMILESCCN(c1ccccc1)c1c(Cl)nc2ccc(cc2c1Cl)C(O)(c1cccnc1)c1cccc(Cl)c1