Reaction Details
TargetNeuronal acetylcholine receptor subunit alpha-3/beta-2
LigandBDBM50428086
Substrate/Competitorn/a
Meas. Tech.[3H]-Epibatidine Radioligand Binding Assay
pH7.4±n/a
Temperature277.15±n/a K
Ki 300±n/a nM
Commentsextracted
Citation Xiao, YKellar, KJBrown, MLPaige, MALiu, YLevin, EDRezvani, AH 2,5-disubstituted-pyridyl nicotinic ligands, and methods of use thereof US Patent US9303017 Publication Date 4/5/2016
 
Neuronal acetylcholine receptor subunit alpha-3/beta-2
Name:Neuronal acetylcholine receptor subunit alpha-3/beta-2
Type:Protein
Mol. Mass.:n/a
Description:n/a
Components:This complex has 2 components.
Component 1
Name:Neuronal acetylcholine receptor subunit alpha-3
Synonyms:ACHA3_RAT Chrna3
Type:Enzyme
Mol. Mass.:56995.52
Organism:Rattus norvegicus (Rat)
Description:P04757
Residue:499
Component 2
Name:Neuronal acetylcholine receptor subunit beta-2
Synonyms:ACHB2_RAT Chrnb2 Neuronal acetylcholine receptor non-alpha-1 chain
Type:Enzyme
Mol. Mass.:56910.32
Organism:Rattus norvegicus (Rat)
Description:P12390
Residue:500
BDBM50428086
NameBDBM50428086
Synonyms:CHEMBL2323572 | US9303017, (S)-21, YL-1-235
TypeSmall organic molecule
Emp. Form.C16H21ClN2O
Mol. Mass.292.804
SMILESCc1ncc(cc1OC[C@@H]1CCN1)C#CCCCCCl