Reaction Details
TargetNeuronal acetylcholine receptor subunit alpha-4/beta-2
LigandBDBM50428081
Substrate/Competitorn/a
Meas. Tech.[3H]-Epibatidine Radioligand Binding Assay
pH7.4±n/a
Temperature277.15±n/a K
Ki 4.3±n/a nM
Commentsextracted
Citation Xiao, YKellar, KJBrown, MLPaige, MALiu, YLevin, EDRezvani, AH 2,5-disubstituted-pyridyl nicotinic ligands, and methods of use thereof US Patent US9303017 Publication Date 4/5/2016
 
Neuronal acetylcholine receptor subunit alpha-4/beta-2
Name:Neuronal acetylcholine receptor subunit alpha-4/beta-2
Type:Protein
Mol. Mass.:n/a
Description:n/a
Components:This complex has 2 components.
Component 1
Name:Neuronal acetylcholine receptor subunit alpha-4
Synonyms:ACHA4_HUMAN CHRNA4 protein Neuronal acetylcholine receptor protein alpha-4 subunit Nicotinic acetylcholine receptor alpha4/beta2/alpha5
Type:n/a
Mol. Mass.:69963.49
Organism:Homo sapiens (Human)
Description:NACHRA4
Residue:627
Component 2
Name:Neuronal acetylcholine receptor subunit beta-2
Synonyms:ACHB2_HUMAN Neuronal acetylcholine receptor protein beta-2 subunit | Nicotinic acetylcholine receptor alpha3/beta2/alpha5
Type:Protein
Mol. Mass.:57020.50
Organism:Homo sapiens (Human)
Description:P17787
Residue:502
BDBM50428081
NameBDBM50428081
Synonyms:CHEMBL2323570 | US9303017, (S)-17
TypeSmall organic molecule
Emp. Form.C16H22N2O2
Mol. Mass.274.3581
SMILESCc1ncc(cc1OC[C@@H]1CCN1)C#CCCCCO