Reaction Details
TargetApoptosis regulator Bcl-2
LigandBDBM144855
Substrate/Competitorn/a
Meas. Tech.Time Resolved-Fluorescence Resonance Energy Transfer (TR-FRET) Assay
Temperature298.15±n/a K
Ki 0.005±n/a nM
Commentsextracted
Citation Bruncko, MDing, HDoherty, GAElmore, SWHasvold, LHexamer, LKunzer, ARMantei, RAPark, CSong, XSouers, AJSullivan, GMTao, ZWang, GTWang, LWang, XWendt, MD Apoptosis-inducing agents for the treatment of cancer and immune and autoimmune diseases US Patent US9303025 Publication Date 4/5/2016
 
Apoptosis regulator Bcl-2
Name:Apoptosis regulator Bcl-2
Type:Homodimer or heterodimer
Mol. Mass.:26269.11
Organism:Homo sapiens (Human)
Description:P10415
Residue:239
BDBM144855
NameBDBM144855
Synonyms:US8952157, 37 | US9303025, 37
TypeSmall organic molecule
Emp. Form.C46H51Cl2N7O7S
Mol. Mass.916.911
SMILESCN(C)CCOc1ccc(c(CN2CCN(CC2)c2ccc(C(=O)NS(=O)(=O)c3ccc(NC4CCN(C)CC4)c(c3)[N+]([O-])=O)c(Oc3cccc(Cl)c3)c2)c1)-c1ccc(Cl)cc1