Reaction Details
TargetApoptosis regulator Bcl-2
LigandBDBM145144
Substrate/Competitorn/a
Meas. Tech.Time Resolved-Fluorescence Resonance Energy Transfer (TR-FRET) Assay
Temperature298.15±n/a K
Ki<0.010±n/a nM
Commentsextracted
Citation Bruncko, MDing, HDoherty, GAElmore, SWHasvold, LHexamer, LKunzer, ARMantei, RAPark, CSong, XSouers, AJSullivan, GMTao, ZWang, GTWang, LWang, XWendt, MD Apoptosis-inducing agents for the treatment of cancer and immune and autoimmune diseases US Patent US9303025 Publication Date 4/5/2016
 
Apoptosis regulator Bcl-2
Name:Apoptosis regulator Bcl-2
Type:Homodimer or heterodimer
Mol. Mass.:26269.11
Organism:Homo sapiens (Human)
Description:P10415
Residue:239
BDBM145144
NameBDBM145144
Synonyms:US8952157, 335 | US9303025, 335
TypeSmall organic molecule
Emp. Form.C51H59ClFN7O7S
Mol. Mass.968.573
SMILESCC1(C)CCC(CN2CCN(CC2)c2ccc(C(=O)NS(=O)(=O)c3ccc(NC4CCC(CC4)NC4CCOCC4)c(c3)[N+]([O-])=O)c(Oc3cc4cc[nH]c4cc3F)c2)=C(C1)c1ccc(Cl)cc1