Reaction Details
TargetApoptosis regulator Bcl-2
LigandBDBM145200
Substrate/Competitorn/a
Meas. Tech.Time Resolved-Fluorescence Resonance Energy Transfer (TR-FRET) Assay
Temperature298.15±n/a K
Ki<0.010±n/a nM
Commentsextracted
Citation Bruncko, MDing, HDoherty, GAElmore, SWHasvold, LHexamer, LKunzer, ARMantei, RAPark, CSong, XSouers, AJSullivan, GMTao, ZWang, GTWang, LWang, XWendt, MD Apoptosis-inducing agents for the treatment of cancer and immune and autoimmune diseases US Patent US9303025 Publication Date 4/5/2016
 
Apoptosis regulator Bcl-2
Name:Apoptosis regulator Bcl-2
Type:Homodimer or heterodimer
Mol. Mass.:26269.11
Organism:Homo sapiens (Human)
Description:P10415
Residue:239
BDBM145200
NameBDBM145200
Synonyms:US8952157, 391 | US9303025, 391
TypeSmall organic molecule
Emp. Form.C48H56Cl2F2N8O7S
Mol. Mass.997.975
SMILESNc1ncc(Oc2cc(ccc2C(=O)NS(=O)(=O)c2ccc(NCC3CCOCC3)c(c2)[N+]([O-])=O)N2CCN(CC3=C(CCC4(CCN(CC4)C(CF)CF)C3)c3ccc(Cl)cc3)CC2)cc1Cl