Reaction Details
TargetCystic fibrosis transmembrane conductance regulator
LigandBDBM221979
Substrate/Competitorn/a
Meas. Tech.IonWorks Quattro Assay
IC50>30±n/a nM
Citation Ahmed, MAshall-Kelly, ABloomfield, GCGueritz, LMcKenna, JMcKenna, JMutton, SParmar, RSheperd, JWright, P Substituted pyrazino[1′,2′:1,2]pyrrolo[3,4-d]pyrimidines, pyrimido[4′,5′:3,4]pyrrolo[2,1-c][1,4]oxazines and pyrimido[4′,5′:3,4]pyrrolo[1,2-d][1,4]oxazepines for inhibiting the CFTR channel US Patent US9303035 Publication Date 4/5/2016
 
Cystic fibrosis transmembrane conductance regulator
Name:Cystic fibrosis transmembrane conductance regulator
Synonyms:cystic fibrosis transmembrane conductance regulator protein (CFTR)
Type:Protein
Mol. Mass.:125499.86
Organism:Cricetulus griseus (Chinese hamster)
Description:G3H9J3
Residue:1107
BDBM221979
NameBDBM221979
Synonyms:US9303035, 4.2
TypeSmall organic molecule
Emp. Form.C22H18ClN5O4S
Mol. Mass.483.927
SMILESCn1c2c3[C@H](O[C@H](CO)Cn3c(-c3cccc(c3)C#N)c2c(=O)n(C)c1=O)c1nc(Cl)cs1