Reaction Details
TargetCystic fibrosis transmembrane conductance regulator
LigandBDBM221984
Substrate/Competitorn/a
Meas. Tech.IonWorks Quattro Assay
IC50 0.09±n/a nM
Citation Ahmed, MAshall-Kelly, ABloomfield, GCGueritz, LMcKenna, JMcKenna, JMutton, SParmar, RSheperd, JWright, P Substituted pyrazino[1′,2′:1,2]pyrrolo[3,4-d]pyrimidines, pyrimido[4′,5′:3,4]pyrrolo[2,1-c][1,4]oxazines and pyrimido[4′,5′:3,4]pyrrolo[1,2-d][1,4]oxazepines for inhibiting the CFTR channel US Patent US9303035 Publication Date 4/5/2016
 
Cystic fibrosis transmembrane conductance regulator
Name:Cystic fibrosis transmembrane conductance regulator
Synonyms:cystic fibrosis transmembrane conductance regulator protein (CFTR)
Type:Protein
Mol. Mass.:125499.86
Organism:Cricetulus griseus (Chinese hamster)
Description:G3H9J3
Residue:1107
BDBM221984
NameBDBM221984
Synonyms:US9303035, 7.0a
TypeSmall organic molecule
Emp. Form.C20H19ClN4O5S
Mol. Mass.462.907
SMILESCc1csc(n1)-c1n2CC(CO)OC(c3ccc(Cl)o3)c2c2n(C)c(=O)n(C)c(=O)c12