Reaction Details
TargetCystic fibrosis transmembrane conductance regulator
LigandBDBM221992
Substrate/Competitorn/a
Meas. Tech.IonWorks Quattro Assay
IC50 0.24±n/a nM
Citation Ahmed, MAshall-Kelly, ABloomfield, GCGueritz, LMcKenna, JMcKenna, JMutton, SParmar, RSheperd, JWright, P Substituted pyrazino[1′,2′:1,2]pyrrolo[3,4-d]pyrimidines, pyrimido[4′,5′:3,4]pyrrolo[2,1-c][1,4]oxazines and pyrimido[4′,5′:3,4]pyrrolo[1,2-d][1,4]oxazepines for inhibiting the CFTR channel US Patent US9303035 Publication Date 4/5/2016
 
Cystic fibrosis transmembrane conductance regulator
Name:Cystic fibrosis transmembrane conductance regulator
Synonyms:cystic fibrosis transmembrane conductance regulator protein (CFTR)
Type:Protein
Mol. Mass.:125499.86
Organism:Cricetulus griseus (Chinese hamster)
Description:G3H9J3
Residue:1107
BDBM221992
NameBDBM221992
Synonyms:US9303035, 12.2
TypeSmall organic molecule
Emp. Form.C23H21Cl2N3O5
Mol. Mass.490.336
SMILESCOCC1Cn2c(C(O1)c1ccc(Cl)o1)c1n(C)c(=O)n(C)c(=O)c1c2-c1cccc(Cl)c1