Reaction Details
TargetC-X-C chemokine receptor type 4
LigandBDBM221760
Substrate/Competitorn/a
Meas. Tech.Calcium Mobilization Assay
Temperature310.15±n/a K
IC50 1±n/a nM
Commentsextracted
Citation Clark, MPWagner, FFNatchus, MGDoroh, BCJohnson, TLTahirovic, YAWilson, LWiseman, JMSkudlarek, JWLockwood, MA Chemokine receptor modulators US Patent US9314468 Publication Date 4/19/2016
 
C-X-C chemokine receptor type 4
Name:C-X-C chemokine receptor type 4
Type:Enzyme
Mol. Mass.:39754.61
Organism:Homo sapiens (Human)
Description:P61073
Residue:352
BDBM221760
NameBDBM221760
Synonyms:US9314468, Table 7, Compound 47
TypeSmall organic molecule
Emp. Form.C31H39N5O2
Mol. Mass.513.6737
SMILESCC(C)(C)OC(=O)Cn1c2ccccc2c2ccnc(CN(CCCCN)[C@H]3CCCc4cccnc34)c12