Reaction Details
TargetBeta-2 adrenergic receptor
LigandBDBM221903
Substrate/Competitorn/a
Meas. Tech.Adrenergic Receptor Binding Assay
Temperature298.15±n/a K
IC50 2.2±n/a nM
Commentsextracted
Citation Prat Quinones, MFonquerna Pou, SPuig Duran, CLumeras Amador, WAiguade Bosch, JCaturla Jovaloyes, JF Cyclohexylamine derivatives having β2 adrenergic agonist and M3 muscarinic antagonist activities US Patent US9315463 Publication Date 4/19/2016
 
Beta-2 adrenergic receptor
Name:Beta-2 adrenergic receptor
Type:n/a
Mol. Mass.:46461.69
Organism:Homo sapiens (Human)
Description:P07550
Residue:413
BDBM221903
NameBDBM221903
Synonyms:US9315463, 13
TypeSmall organic molecule
Emp. Form.C40H45ClN4O8S2
Mol. Mass.809.39
SMILESCOc1cc(NC(=O)CCN(C)[C@H]2CC[C@@](C)(CC2)OC(=O)C(O)(c2cccs2)c2cccs2)c(Cl)cc1CNC[C@H](O)c1ccc(O)c2[nH]c(=O)ccc12