Reaction Details
TargetAcetylcholinesterase
LigandBDBM10620
Substrate/Competitorn/a
Meas. Tech.AChE and BChE Inhibition Assay
pH8±n/a
Temperature298.15±n/a K
IC50 1.107e+4± 1e+1 nM
Commentsextracted
Citation Saeedi, MSafavi, MKarimpour-Razkenari, EMahdavi, MEdraki, NMoghadam, FHKhanavi, MAkbarzadeh, T Synthesis of novel chromenones linked to 1,2,3-triazole ring system: Investigation of biological activities against Alzheimer's disease. Bioorg Chem70:86-93 (2017) 
 
Acetylcholinesterase
Name:Acetylcholinesterase
Type:Enzyme
Mol. Mass.:71812.79
Organism:Electrophorus electricus (Electric eel)
Description:n/a
Residue:633
BDBM10620
NameBDBM10620
Synonyms:(S)-3-(1-(dimethylamino)ethyl)phenyl ethyl(methyl)carbamate 3-(1-(dimethylamino)ethyl)phenyl ethyl(methyl)carbamate CHEMBL636 Ethyl-methyl-carbamic acid 3-((R)-1-dimethylamino-ethyl)-phenyl ester Ethyl-methyl-carbamic acid 3-(1-dimethylamino-ethyl)-phenyl ester Rivastigmine SDZ-212-713 | SDZ-ENA-713
TypeSmall organic molecule
Emp. Form.C14H22N2O2
Mol. Mass.250.3367
SMILES[H][C@@](C)(N(C)C)c1cccc(OC(=O)N(C)CC)c1