Reaction Details
TargetTyrosine-protein kinase ABL1
LigandBDBM6096
Substrate/Competitorn/a
Meas. Tech.Homogeneous Time-resolved Fluorescence (HTRF) Assay
IC50 0.78±n/a nM
Citation Boschelli, DHWu, BBarrios Sosa, ACDurutlic, HChen, JJWang, YGolas, JMLucas, JBoschelli, F Synthesis and Src kinase inhibitory activity of 2-phenyl- and 2-thienyl-7-phenylaminothieno[3,2-b]pyridine-6-carbonitriles. J Med Chem48:3891-902 (2005) 
 
Tyrosine-protein kinase ABL1
Name:Tyrosine-protein kinase ABL1
Type:Enzyme
Mol. Mass.:122897.30
Organism:Homo sapiens (Human)
Description:P00519
Residue:1130
BDBM6096
NameBDBM6096
Synonyms:3-quinolinecarbonitrile 24 4-[(2,4-dichloro-5-methoxyphenyl)amino]-6-methoxy-7-[3-(1-methylpiperidin-4-yl)propoxy]quinoline-3-carbonitrile | 4-phenylamino-3-quinolinecarbonitrile 7
TypeSmall organic molecule
Emp. Form.C27H30Cl2N4O3
Mol. Mass.529.458
SMILESCOc1cc(Nc2c(cnc3cc(OCCCC4CCN(C)CC4)c(OC)cc23)C#N)c(Cl)cc1Cl