Reaction Details
TargetALK tyrosine kinase/Hepatocyte growth factor receptor
LigandBDBM222077
Substrate/Competitorn/a
Meas. Tech.In Vitro c-Met Enzyme Assay
IC50 1.348e+4± 1.12e+3 nM
Citation Yang, YZhang, YYang, LZhao, LSi, LZhang, HLiu, QZhou, J Discovery of imidazopyridine derivatives as novel c-Met kinase inhibitors: Synthesis, SAR study, and biological activity. Bioorg Chem70:126-132 (2017) 
 
ALK tyrosine kinase/Hepatocyte growth factor receptor
Name:ALK tyrosine kinase/Hepatocyte growth factor receptor
Synonyms:c-Met/ALK
Type:Protein
Mol. Mass.:n/a
Description:n/a
Components:This complex has 2 components.
Component 1
Name:Hepatocyte growth factor receptor
Type:Protein
Mol. Mass.:155559.73
Organism:Homo sapiens (Human)
Description:P08581
Residue:1390
Component 2
Name:ALK tyrosine kinase receptor
Synonyms:ALK ALK_HUMAN CD_antigen: CD246
Type:Protein
Mol. Mass.:176453.10
Organism:Homo sapiens (Human)
Description:Q9UM73
Residue:1620
BDBM222077
NameBDBM222077
Synonyms:6-chloro-3-((2-(2,5-dichlorophenyl)imidazo[1,2-a]pyridin-8-yl)methoxy)-[1,2,4]triazolo[4,3-b] pyridazine (7e)
TypeSmall organic molecule
Emp. Form.C19H11Cl3N6O
Mol. Mass.445.689
SMILESClc1ccc(Cl)c(c1)-c1cn2cccc(COc3nnc4ccc(Cl)nn34)c2n1