Reaction Details
TargetALK tyrosine kinase/Hepatocyte growth factor receptor
LigandBDBM24470
Substrate/Competitorn/a
Meas. Tech.In Vitro c-Met Enzyme Assay
IC50 8e+1± 2e+1 nM
Citation Yang, YZhang, YYang, LZhao, LSi, LZhang, HLiu, QZhou, J Discovery of imidazopyridine derivatives as novel c-Met kinase inhibitors: Synthesis, SAR study, and biological activity. Bioorg Chem70:126-132 (2017) 
 
ALK tyrosine kinase/Hepatocyte growth factor receptor
Name:ALK tyrosine kinase/Hepatocyte growth factor receptor
Synonyms:c-Met/ALK
Type:Protein
Mol. Mass.:n/a
Description:n/a
Components:This complex has 2 components.
Component 1
Name:Hepatocyte growth factor receptor
Type:Protein
Mol. Mass.:155559.73
Organism:Homo sapiens (Human)
Description:P08581
Residue:1390
Component 2
Name:ALK tyrosine kinase receptor
Synonyms:ALK ALK_HUMAN CD_antigen: CD246
Type:Protein
Mol. Mass.:176453.10
Organism:Homo sapiens (Human)
Description:Q9UM73
Residue:1620
BDBM24470
NameBDBM24470
Synonyms:7-methoxy-4-({6-phenyl-[1,2,4]triazolo[4,3-a]pyridazin-3-yl}methoxy)quinoline Triazolopyridazine, 4
TypeSmall organic molecule
Emp. Form.C22H17N5O2
Mol. Mass.383.4027
SMILESCOc1ccc2c(OCc3nnc4ccc(nn34)-c3ccccc3)ccnc2c1