Reaction Details
TargetChymotrypsinogen A
LigandBDBM50289000
Substrate/Competitorn/a
Meas. Tech.α-Chymotrypsin Inhibition Kinetic Assay
Ki 1.25e+4± 1.2e+3 nM
Citation Marasini, BPRahim, FPerveen, SKarim, AMohammed Khan, KAtta-Ur-Rahman, nullChoudhary, MI Synthesis, structure-activity relationships studies of benzoxazinone derivatives as a-chymotrypsin inhibitors. Bioorg Chem70:210-221 (2017) 
 
Chymotrypsinogen A
Name:Chymotrypsinogen A
Type:Serine protease
Mol. Mass.:25670.88
Organism:Bos taurus (bovine)
Description:n/a
Residue:245
BDBM50289000
NameBDBM50289000
Synonyms:2-(2-Methoxy-phenyl)-benzo[d][1,3]oxazin-4-one CHEMBL349853
TypeSmall organic molecule
Emp. Form.C15H11NO3
Mol. Mass.253.2527
SMILESCOc1ccccc1-c1nc2ccccc2c(=O)o1