Reaction Details
TargetChymotrypsinogen A
LigandBDBM222128
Substrate/Competitorn/a
Meas. Tech.α-Chymotrypsin Inhibition Kinetic Assay
Ki 3.026e+5± 5.8e+3 nM
Citation Marasini, BPRahim, FPerveen, SKarim, AMohammed Khan, KAtta-Ur-Rahman, nullChoudhary, MI Synthesis, structure-activity relationships studies of benzoxazinone derivatives as a-chymotrypsin inhibitors. Bioorg Chem70:210-221 (2017) 
 
Chymotrypsinogen A
Name:Chymotrypsinogen A
Type:Serine protease
Mol. Mass.:25670.88
Organism:Bos taurus (bovine)
Description:n/a
Residue:245
BDBM222128
NameBDBM222128
Synonyms:7-Chloro-2-(2-fluorophenyl)-4H-3,1-benzoxazin-4-one (17)
TypeSmall organic molecule
Emp. Form.C14H7ClFNO2
Mol. Mass.275.662
SMILESFc1ccccc1-c1nc2cc(Cl)ccc2c(=O)o1