Reaction Details
TargetAlkaline phosphatase, tissue-nonspecific isozyme
LigandBDBM222189
Substrate/Competitorn/a
Meas. Tech.Alkaline Phosphatase Inhibition Assay
pH9.8±n/a
Temperature310.15±n/a K
IC50 1.69e+3± 6.1e+2 nM
Commentsextracted
Citation Bhatti, HAKhatoon, MAl-Rashida, MBano, HIqbal, NZaib-Un-Nisa, nullYousuf, SKhan, KMHameed, AIqbal, J Facile dimethyl amino group triggered cyclic sulfonamides synthesis and evaluation as alkaline phosphatase inhibitors. Bioorg Chem71:10-18 (2017) 
 
Alkaline phosphatase, tissue-nonspecific isozyme
Name:Alkaline phosphatase, tissue-nonspecific isozyme
Type:Protein
Mol. Mass.:57195.60
Organism:Bos taurus (Cattle)
Description:P09487
Residue:524
BDBM222189
NameBDBM222189
Synonyms:6-(Dimethylamino)-3-(3'-hydroxy-4'-methoxyphenyl)-2,3-dihydronaphtho[1,8-de][1,2]thiazine 1,1-dioxide (7k)
TypeSmall organic molecule
Emp. Form.C20H20N2O4S
Mol. Mass.384.449
SMILESCOc1ccc(cc1O)C1NS(=O)(=O)c2cccc3c(ccc1c23)N(C)C