Reaction Details
TargetOligo-1,6-glucosidase IMA1
LigandBDBM222214
Substrate/Competitorn/a
Meas. Tech.α-Glucosidase Inhibition Assay
IC50 1.196e+4± 5e+1 nM
Citation Chaudhry, FNaureen, SHuma, RShaukat, AAl-Rashida, MAsif, NAshraf, MMunawar, MAKhan, MA In search of new a-glucosidase inhibitors: Imidazolylpyrazole derivatives. Bioorg Chem71:102-109 (2017) 
 
Oligo-1,6-glucosidase IMA1
Name:Oligo-1,6-glucosidase IMA1
Type:Protein
Mol. Mass.:68577.59
Organism:Saccharomyces cerevisiae S288c (Baker's yeast)
Description:n/a
Residue:589
BDBM222214
NameBDBM222214
Synonyms:3-(4-Bromophenyl)-4-(4,5-diphenyl-1H-imidazol-2-yl)-1-phenyl-1H-pyrazole (2c)
TypeSmall organic molecule
Emp. Form.C30H21BrN4
Mol. Mass.517.419
SMILESBrc1ccc(cc1)-c1nn(cc1-c1nc(c([nH]1)-c1ccccc1)-c1ccccc1)-c1ccccc1