Reaction Details
TargetOligo-1,6-glucosidase IMA1
LigandBDBM222222
Substrate/Competitorn/a
Meas. Tech.α-Glucosidase Inhibition Assay
IC50 2.95e+3± 1 nM
Citation Chaudhry, FNaureen, SHuma, RShaukat, AAl-Rashida, MAsif, NAshraf, MMunawar, MAKhan, MA In search of new a-glucosidase inhibitors: Imidazolylpyrazole derivatives. Bioorg Chem71:102-109 (2017) 
 
Oligo-1,6-glucosidase IMA1
Name:Oligo-1,6-glucosidase IMA1
Type:Protein
Mol. Mass.:68577.59
Organism:Saccharomyces cerevisiae S288c (Baker's yeast)
Description:n/a
Residue:589
BDBM222222
NameBDBM222222
Synonyms:6-Bromo-3-(4-(4,5-diphenyl-1H-imidazol-2-yl)-1-phenyl-1Hpyrazol-3-yl)-2H-chromen 2-one (2k)
TypeSmall organic molecule
Emp. Form.C33H21BrN4O2
Mol. Mass.585.449
SMILESBrc1ccc2oc(=O)c(cc2c1)-c1nn(cc1-c1nc(c([nH]1)-c1ccccc1)-c1ccccc1)-c1ccccc1