Reaction Details
TargetCytochrome P450 144 [31-434]
LigandBDBM222346
Substrate/Competitorn/a
Meas. Tech.Optical Titration Assay
pH7±n/a
Kd 8.2e+4± 4e+3 nM
Commentsextracted
Citation Kavanagh, MEChenge, JZoufir, AMcLean, KJCoyne, AGBender, AMunro, AWAbell, C Fragment Profiling Approach to Inhibitors of the Orphan M. tuberculosis P450 CYP144A1. Biochemistry56:1559-1572 (2017) 
 
Cytochrome P450 144 [31-434]
Name:Cytochrome P450 144 [31-434]
Type:Protein
Mol. Mass.:43963.64
Organism:Mycobacterium tuberculosis
Description:M. tuberculosis cytochrome P450 144 truncation (31-434 aa)
Residue:404
BDBM222346
NameBDBM222346
Synonyms:CYP144A1 ligand, 1
TypeSmall organic molecule
Emp. Form.C23H19N5O2
Mol. Mass.397.4293
SMILESOc1ccc(cc1)-c1n[nH]c(NCc2cccc3[nH]ncc23)c1-c1ccc(O)cc1