Reaction Details
TargetCytochrome P450 144 [31-434]
LigandBDBM222349
Substrate/Competitorn/a
Meas. Tech.Optical Titration Assay
pH7±n/a
Kd 2.30e+5± 3e+3 nM
Commentsextracted
Citation Kavanagh, MEChenge, JZoufir, AMcLean, KJCoyne, AGBender, AMunro, AWAbell, C Fragment Profiling Approach to Inhibitors of the Orphan M. tuberculosis P450 CYP144A1. Biochemistry56:1559-1572 (2017) 
 
Cytochrome P450 144 [31-434]
Name:Cytochrome P450 144 [31-434]
Type:Protein
Mol. Mass.:43963.64
Organism:Mycobacterium tuberculosis
Description:M. tuberculosis cytochrome P450 144 truncation (31-434 aa)
Residue:404
BDBM222349
NameBDBM222349
Synonyms:CYP144A1 ligand, 4
TypeSmall organic molecule
Emp. Form.C9H7BrN2
Mol. Mass.223.069
SMILESBrc1ccc(cc1)-c1c[nH]cn1