Reaction Details
TargetCarbonic anhydrase 2
LigandBDBM222433
Substrate/Competitorn/a
Meas. Tech.Carbonic Anhydrase II Inhibition Assay
pH7.4±n/a
Temperature298.15±n/a K
IC50 2.33e+3± 2e+1 nM
Commentsextracted
Citation Iqbal, SSaleem, MAzim, MKTaha, MSalar, UKhan, KMPerveen, SChoudhary, MI Carbohydrazones as new class of carbonic anhydrase inhibitors: Synthesis, kinetics, and ligand docking studies. Bioorg Chem72:89-101 (2017) 
 
Carbonic anhydrase 2
Name:Carbonic anhydrase 2
Type:Enzyme Catalytic Domain
Mol. Mass.:29115.93
Organism:Bos taurus
Description:n/a
Residue:260
BDBM222433
NameBDBM222433
Synonyms:N'',N'''-Bis[(E)-(2-chlorophenyl)methylidene]carbonic dihydrazide (7)
TypeSmall organic molecule
Emp. Form.C15H12Cl2N4O
Mol. Mass.335.188
SMILESClc1ccccc1\C=N\NC(=O)N\N=C\c1ccccc1Cl