Reaction Details
TargetDNA polymerase catalytic subunit
LigandBDBM222903
Substrate/Competitorn/a
Meas. Tech.HCMV Polymerase LANCE TR-FRET Assay
pH7.5±n/a
IC50 62±n/a nM
Commentsextracted
Citation Fader, LLepage, OBailey, MBeaulieu, PLBilodeau, FCarson, RJGiroux, AGodbout, CMoreau, BNaud, JParisien, MPoirier, MPoirier, MSurprenant, SThibeault, C Cytomegalovirus inhibitor compounds US Patent US9315499 Publication Date 4/19/2016
 
DNA polymerase catalytic subunit
Name:DNA polymerase catalytic subunit
Type:Protein
Mol. Mass.:137111.39
Organism:Human cytomegalovirus (HCMV strain AD169)
Description:P08546
Residue:1242
BDBM222903
NameBDBM222903
Synonyms:US9315499, 3038
TypeSmall organic molecule
Emp. Form.C28H30ClN5O5
Mol. Mass.552.021
SMILESCC1(C)CN(C1)C(=O)Cn1c2nccc(OC[C@@H]3CCC(=O)N3)c2cc(C(=O)NCc2ccc(Cl)cc2)c1=O