Reaction Details
TargetDNA polymerase catalytic subunit
LigandBDBM222906
Substrate/Competitorn/a
Meas. Tech.HCMV Polymerase LANCE TR-FRET Assay
pH7.5±n/a
IC50 30±n/a nM
Commentsextracted
Citation Fader, LLepage, OBailey, MBeaulieu, PLBilodeau, FCarson, RJGiroux, AGodbout, CMoreau, BNaud, JParisien, MPoirier, MPoirier, MSurprenant, SThibeault, C Cytomegalovirus inhibitor compounds US Patent US9315499 Publication Date 4/19/2016
 
DNA polymerase catalytic subunit
Name:DNA polymerase catalytic subunit
Type:Protein
Mol. Mass.:137111.39
Organism:Human cytomegalovirus (HCMV strain AD169)
Description:P08546
Residue:1242
BDBM222906
NameBDBM222906
Synonyms:US9315499, 4012
TypeSmall organic molecule
Emp. Form.C24H23ClN8O3
Mol. Mass.506.944
SMILESCC1(C)CN(C1)C(=O)Cn1c2ncc(cc2cc(C(=O)NCc2ccc(Cl)cc2)c1=O)-c1nn[nH]n1