Reaction Details
TargetDNA polymerase catalytic subunit
LigandBDBM222907
Substrate/Competitorn/a
Meas. Tech.HCMV Polymerase LANCE TR-FRET Assay
pH7.5±n/a
IC50 180±n/a nM
Commentsextracted
Citation Fader, LLepage, OBailey, MBeaulieu, PLBilodeau, FCarson, RJGiroux, AGodbout, CMoreau, BNaud, JParisien, MPoirier, MPoirier, MSurprenant, SThibeault, C Cytomegalovirus inhibitor compounds US Patent US9315499 Publication Date 4/19/2016
 
DNA polymerase catalytic subunit
Name:DNA polymerase catalytic subunit
Type:Protein
Mol. Mass.:137111.39
Organism:Human cytomegalovirus (HCMV strain AD169)
Description:P08546
Residue:1242
BDBM222907
NameBDBM222907
Synonyms:US9315499, 4017
TypeSmall organic molecule
Emp. Form.C28H30ClN7O3
Mol. Mass.548.036
SMILESCc1cc(Nc2cnc3n(CC(=O)N4CC(C)(C)C4)c(=O)c(cc3c2)C(=O)NCc2ccc(Cl)cc2)n(C)n1