Reaction Details
TargetDNA polymerase catalytic subunit
LigandBDBM222911
Substrate/Competitorn/a
Meas. Tech.HCMV Polymerase LANCE TR-FRET Assay
pH7.5±n/a
IC50 120±n/a nM
Commentsextracted
Citation Fader, LLepage, OBailey, MBeaulieu, PLBilodeau, FCarson, RJGiroux, AGodbout, CMoreau, BNaud, JParisien, MPoirier, MPoirier, MSurprenant, SThibeault, C Cytomegalovirus inhibitor compounds US Patent US9315499 Publication Date 4/19/2016
 
DNA polymerase catalytic subunit
Name:DNA polymerase catalytic subunit
Type:Protein
Mol. Mass.:137111.39
Organism:Human cytomegalovirus (HCMV strain AD169)
Description:P08546
Residue:1242
BDBM222911
NameBDBM222911
Synonyms:US9315499, 4034
TypeSmall organic molecule
Emp. Form.C26H24ClFN6O3
Mol. Mass.522.959
SMILESCn1cnc(c1)-c1cnc2n(CC(=O)N3CC(C)(F)C3)c(=O)c(cc2c1)C(=O)NCc1ccc(Cl)cc1